[KPhotoAlbum] make errors

Rick Christian rec9140 at gmail.com
Tue Mar 29 14:59:09 CEST 2011


On 3/28/11, kphotoalbum-request at kdab.com <kphotoalbum-request at kdab.com> wrote:

> Rick, your packages are broken, and there's absolutely nothing we can do

I've removed the marble check and then get to this point

cmake . works

make results in this fatal error:

info:
rec9140 at rec9140-test-machine ~/kphotoalbum-4.1.1 $ uname -a
Linux rec9140-test-machine 2.6.35-22-generic #33-Ubuntu SMP Sun Sep 19
20:34:50 UTC 2010 i686 GNU/Linux

rec9140 at rec9140-test-machine ~/kphotoalbum-4.1.1 $ lsb_release -rd
Description:    Linux Mint 10 KDE
Release:        10

This is KDE 4.6.1

Scanning dependencies of target pofiles
[ 97%] Generating kphotoalbum.gmo
[ 98%] Built target pofiles
Scanning dependencies of target kphotoalbum-handbook
[ 98%] Generating index.cache.bz2
index.docbook:22: warning: failed to load external entity
"dtd/kdex.dtd"
]>
  ^
index.docbook:24: parser error : Entity 'language' not defined
<book lang="&language;">
                      ^
index.docbook:24: element book: validity error : No declaration for
attribute lang of element book
<book lang="&language;">
                       ^
index.docbook:28: element application: validity error : No declaration
for element application
>Das Handbuch zu &kphotoalbum;</title>
                              ^
index.docbook:28: element title: validity error : No declaration for
element title
>Das Handbuch zu &kphotoalbum;</title>
                                      ^
index.docbook:34: element firstname: validity error : No declaration
for element firstname
> <surname
 ^
index.docbook:36: element surname: validity error : No declaration for
element surname
> </author>
 ^
index.docbook:36: element author: validity error : No declaration for
element author
> </author>
           ^
index.docbook:39: element othercredit: validity error : No declaration
for attribute role of element othercredit
><firstname
^
index.docbook:41: element firstname: validity error : No declaration
for element firstname
><surname
 ^
index.docbook:43: element surname: validity error : No declaration for
element surname
><affiliation
 ^
index.docbook:47: element email: validity error : No declaration for
element email
></address
 ^
index.docbook:48: element address: validity error : No declaration for
element address
></affiliation
 ^
index.docbook:49: element affiliation: validity error : No declaration
for element affiliation
><contrib
 ^
index.docbook:51: element contrib: validity error : No declaration for
element contrib
></othercredit
 ^
index.docbook:52: element othercredit: validity error : No declaration
for element othercredit
>
 ^
index.docbook:53: element authorgroup: validity error : No declaration
for element authorgroup
    </authorgroup>
                  ^
index.docbook:57: element year: validity error : No declaration for element year
>2003-2007</year>
                 ^
index.docbook:59: element holder: validity error : No declaration for
element holder
>Jesper K. Pedersen</holder>
                            ^
index.docbook:61: element copyright: validity error : No declaration
for element copyright
    </copyright>
                ^
index.docbook:64: element date: validity error : No declaration for element date
>2004-08-06</date>
                  ^
index.docbook:66: element releaseinfo: validity error : No declaration
for element releaseinfo
>2.0</releaseinfo>
                  ^
index.docbook:70: element keyword: validity error : No declaration for
element keyword
>KDE</keyword>
              ^
index.docbook:72: element keyword: validity error : No declaration for
element keyword
>kdeextragear-2</keyword>
                         ^
index.docbook:74: element keyword: validity error : No declaration for
element keyword
>KPhotoAlbum</keyword>
                      ^
index.docbook:76: element keyword: validity error : No declaration for
element keyword
>Bilddatenbank</keyword>
                        ^
index.docbook:77: element keywordset: validity error : No declaration
for element keywordset
    </keywordset>
                 ^
index.docbook:84: element ulink: validity error : No declaration for
attribute url of element ulink
>Homepage von &kphotoalbum;</ulink
^
index.docbook:85: element ulink: validity error : No declaration for
element ulink
> und schauen Sie sich den Schnelleinstieg, die Bildschirmfotos und die Einführ
 ^
index.docbook:86: element para: validity error : No declaration for element para
></listitem>
 ^
index.docbook:86: element listitem: validity error : No declaration
for element listitem
></listitem>
            ^
index.docbook:91: element guimenu: validity error : No declaration for
element guimenu
> den Menüeintrag <guimenuitem
 ^
index.docbook:93: element guimenuitem: validity error : No declaration
for element guimenuitem
>. Daraufhin werden einige Beispiel-Bilder geladen und Sie können die Funktione
 ^
index.docbook:94: element para: validity error : No declaration for element para
></listitem>
 ^
index.docbook:94: element listitem: validity error : No declaration
for element listitem
></listitem>
            ^
index.docbook:96: element itemizedlist: validity error : No
declaration for element itemizedlist
></para>
 ^
index.docbook:96: element para: validity error : No declaration for element para
></para>
        ^
index.docbook:100: element ulink: validity error : No declaration for
attribute url of element ulink
>Homepage von &kphotoalbum;</ulink
^
index.docbook:101: element ulink: validity error : No declaration for
element ulink
> als ein zusammenhängendes <acronym
 ^
index.docbook:103: element acronym: validity error : No declaration
for element acronym
>-Dokument zum Herunterladen.</para>
 ^
index.docbook:103: element para: validity error : No declaration for
element para
>-Dokument zum Herunterladen.</para>
                                    ^
index.docbook:104: element abstract: validity error : No declaration
for element abstract
</abstract>
           ^
index.docbook:105: element bookinfo: validity error : No declaration
for element bookinfo
  </bookinfo>
             ^
introduction.docbook:1: element chapter: validity error : No
declaration for attribute id of element chapter
<chapter id="introduction">
                          ^
introduction.docbook:3: element title: validity error : No declaration
for element title
>Einleitung</title>
                   ^
introduction.docbook:5: element para: validity error : No declaration
for element para
iben und in den Bildern zu suchen. Dies ist die Aufgabe von &kphotoalbum;.</para
                                                                               ^
introduction.docbook:14: element guilabel: validity error : No
declaration for element guilabel
>, was nützlich ist, wenn Sie für Ihre Bilder einen Text eingeben möchten ode
 ^
introduction.docbook:16: element guilabel: validity error : No
declaration for element guilabel
>, wenn Sie z.B. für eine größere Zahl von Bildern den Ort, die abgebildeten
 ^
introduction.docbook:17: element para: validity error : No declaration
for element para
></listitem>
 ^
introduction.docbook:17: element listitem: validity error : No
declaration for element listitem
></listitem>
            ^
introduction.docbook:23: element emphasis: validity error : No
declaration for element emphasis
> oder <emphasis
 ^
introduction.docbook:25: element emphasis: validity error : No
declaration for element emphasis
>, zuweisen. Sie können Bilder in jeder der gerade genannten Kategorien suchen,
 ^
introduction.docbook:27: element abbrev: validity error : No
declaration for element abbrev
>, Sie können zum Beispiel alle Bilder des Italienurlaubs, auf denen eine besti
 ^
introduction.docbook:28: element para: validity error : No declaration
for element para
></listitem
 ^
introduction.docbook:29: element listitem: validity error : No
declaration for element listitem
>
 ^
introduction.docbook:33: parser error : Entity 'mdash' not defined
ieht, möchte man oft innerhalb von verschiedenen Bildergruppen springen —
                                                                               ^
introduction.docbook:99: parser error : chunk is not well balanced

^
index.docbook:107: parser error : Failure to process entity introduction
  &introduction;
                ^
index.docbook:107: parser error : Entity 'introduction' not defined
  &introduction;
                ^
make[2]: *** [doc-translations/de_kphotoalbum/kphotoalbum/index.cache.bz2]
Error 1
make[1]: *** [doc-translations/de_kphotoalbum/kphotoalbum/CMakeFiles/kphotoalbum-handbook.dir/all]
Error 2
make: *** [all] Error 2


More information about the KPhotoAlbum mailing list