[KPhotoAlbum] newest snapshot doesn't compile

07.09 at martignier.net 07.09 at martignier.net
Fri Jul 17 14:43:50 CEST 2009


thanks, it works now :)


"07.09 at martignier.net" <07.09 at martignier.net> hat am 17. Juli 2009 um 13:56
geschrieben:

> hi, 
> 
> just tried to compile the 20090711 snapshot, it fails with:
> 
> ______________________________________________________________________________
> __
> __________
> [ 56%] Building CXX object
> CMakeFiles/kphotoalbum.dir/MainWindow/CategoryImagePopup.o
> /usr/local/src/kphotoalbum-20090711/MainWindow/CategoryImagePopup.cpp: In
> constructor 'MainWindow::CategoryImagePopup::CategoryImagePopup(QWidget*)':
> /usr/local/src/kphotoalbum-20090711/MainWindow/CategoryImagePopup.cpp:75:
> error:
> 'i18n' was not declared in this scope
> make[2]: *** [CMakeFiles/kphotoalbum.dir/MainWindow/CategoryImagePopup.o]
> Error
> 1
> make[1]: *** [CMakeFiles/kphotoalbum.dir/all] Error 2
> make: *** [all] Error 2
> ______________________________________________________________________________
> __
> __________
> 
> i checked if it's a problem of my setup, so i compiled the snapshot from
> 2009-06-30 and this one worked fine....
> 
> 
> any hints?
> 
> 
> best regards
> costal martignier
> _______________________________________________
> KPhotoAlbum mailing list
> KPhotoAlbum at kdab.net
> http://mail.kdab.net/mailman/listinfo/kphotoalbum


More information about the KPhotoAlbum mailing list