[KPhotoAlbum] newest snapshot doesn't compile

07.09 at martignier.net 07.09 at martignier.net
Fri Jul 17 13:56:37 CEST 2009


hi, 

just tried to compile the 20090711 snapshot, it fails with:

________________________________________________________________________________
__________
[ 56%] Building CXX object
CMakeFiles/kphotoalbum.dir/MainWindow/CategoryImagePopup.o
/usr/local/src/kphotoalbum-20090711/MainWindow/CategoryImagePopup.cpp: In
constructor 'MainWindow::CategoryImagePopup::CategoryImagePopup(QWidget*)':
/usr/local/src/kphotoalbum-20090711/MainWindow/CategoryImagePopup.cpp:75: error:
'i18n' was not declared in this scope
make[2]: *** [CMakeFiles/kphotoalbum.dir/MainWindow/CategoryImagePopup.o] Error
1
make[1]: *** [CMakeFiles/kphotoalbum.dir/all] Error 2
make: *** [all] Error 2
________________________________________________________________________________
__________

i checked if it's a problem of my setup, so i compiled the snapshot from
2009-06-30 and this one worked fine....


any hints?


best regards
costal martignier


More information about the KPhotoAlbum mailing list